Command ld failed with a nonzero exit code xcode 11

May 13, 2019 · Xcode: 10.1 ITK: ITK 5.0 Release Candidate 2. Error:! Apple Mach-O Linder(id) Error!Linker command failed with exit code 1(use -v to see invocation) detail: ld: library not found for -litkdouble-conversion clang: error: linker command failed with exit code 1 (use -v to see invocation) Can someone help me this? I'm new to xcode, 13 years old, and it stopped compiling my code! I'm working in C++ command line. My first project worked fine, but when I tried to run a new project, the build failed (not from syntax errors or anything) and gave me this notification: Rémi Denis-Courmont Audio: filters 6862 Stereo to surround upmixing Audio: filters master git enhancement normal new 2012-05-22T18:46:14+02:00 2012-11-21T22:21:41+01:00 "My suggestion is simple enough: include a filter/plugin in VLC that allows one to upmix audio from mono- or stereo-source to multi-channel audio. Why? code and tried to compile it in XCODE 10.1 and received numerous errors. So my question is what version of XCODE was ... linker command failed with exit code 1 (use ... May 22, 2016 · Hi folks, I’m trying to write unit tests in Xcode (7.0.1). I’m aware that Juce has its own unit testing capabilities, but I want to leverage the built-in tooling capabilities of Xcode. This worked prior to my upgrade to Juce 4.2. As a test, I created an empty Audio Application from Projucer, opened the Xcode project, and added my test target. This creates a file called TestProjectTests.m ...

Kicad 3d models folder

You may see "Command PhaseScriptExecution failed with a nonzero exit code", but that same message could apply to other sources of error. Solution: Go to your Xcode preferences and under the Locations tab, select "Xcode 11.3" in the dropdown menu for Command Line Tools.Describe the bug I cloned the repository this morning, and it doesn't compile to run on an Android simulator. I'm using the master branch with Flutter 1.20.1: % flutter run Running "flutter pub get" in gallery...

ld: in / Users / Objects-normal / x86_64 / TWRAppDelegate. o, file too small for architecture x86_64 clang: error: linker command failed with exit code 1 (use -v to see invocation) 잘되다 갑자기 linker command failed with exit code 1 에러가 뜬다면. Product -> Clean을 하시고 다시 빌드해보세요~ Problem with Xcode : "command compileassetcatalog failed with a nonzero exit code". I did a quick research on the web to try to find the problem, but there seem to be quite a lot of different things that may cause the issue. ( stackoverflow.com/questions/46690619/build-fails-with-command-failed...

2019-11-12 10:07 来自 甘林梦 Xcode错误提示:Command CompileSwiftSources failed with a nonzero exit code,网上找了好多才搞定,通过在Build Setting里面自添加一条user-defined(备注:点击Level 边上的 + 号就可以添加),属性为SWIFT_ENABLE_BATCH_MODE,值为NO。

「linker command failed with exit code 1 (use -v to see invocation)」エラーに遭遇したので備忘録で書きます。 このエラーの原因はいろいろとあるようです。エントリーの最後に他の原因のものに関する記事のリンクも載せておきました。 原因
Oct 25, 2017 · Welcome to LinuxQuestions.org, a friendly and active Linux Community. You are currently viewing LQ as a guest. By joining our community you will have the ability to post topics, receive our newsletter, use the advanced search, subscribe to threads and access many other special features.
What’s the output of a R Snippet node for the command version (just type version and then click eval selection). If all the commands show 3.6.0, I’d like to ask you if it would be possible to share your workflow with us (using dummy data!)?

adrpo 5036 Better code generation for constant arrays Code Generation v1.13.0-dev-nightly defect lochel new 2018-07-05T17:08:17+02:00 2018-07-05T23:34:45+02:00 "There are two issues in the code generation that together creates problems for the new frontend.

Aug 27, 2019 · Oh my good gravy! I was working on a cleanly installed Mac after migrating user accounts onto it. My account is not the primary admin account (eg. UID 501). For some reason Xcode was installed with all the permissions set to that primary user, who has yet to log onto this Mac! I have been … Continue reading "Command CompileAssetCatalog failed with a nonzero exit code"

I corrected that, deleted (Trash) macports, uninstalled Xcode 4.2.1, installed a clean Xcode 4.3 and Command Line Tools, and still fails as follows: [ rosmake ] Generating Install Script using rosdep then executing.
关于Xcode Command PhaseScriptExecution failed with a nonzero exit code 解决方案. 一、问题描述 使用 Xcode 进行代码编写,在进行项目开发拉下来新项目代码的时候编译的过程中一直在报下面这个错误。 Command PhaseScriptExecution failed with a nonzero exit code 通过在网上进行查找后,...

Ever since updating (against my will) to Xcode 11, I'm getting this error when I try to build my project: "Command CodeSign failed with a nonzero exit code". I've tried cleaning my project, resetting my login keychain, and restarting my computer, but I still get this error... what to do?
Kwanjula gifts

MatthewStones_4789Front.fm Page i Wednesday, March 9, 2005 9:28 AMBeginning Databases with PostgreSQL From Novice to ...
nodejs错误:ld: library not found for -lgcc_s.10.5 clang: error: linker command failed with exit code 1 (use -v to see invocation) Command /usr/bin/codesign failed with exit code 1错误的解决办法; Xcode编译常见错误解决:linker command failed with exit code 1 (use -v to see invocation) Android Studio BUILD FAILED finished with ...

当我尝试使用Xcode 9构建应用程序时,错误会中断构建过程: Command CompileStoryboard failed with a nonzero exit code 我打开了新建系统。. 我能做些什么来解决这个问题?
How to change xtream ui admin password

Apr 21, 2020 · hello! you will need to have expo-cli installed on the build server in order to build on app center with expo-updates in your project. i imagine app center probably lets you run scripts before your build so you should be able to install expo-cli first. alternatively, you can remove expo-updates from your app (follow the installation instructions in reverse).

Aug 06, 2018 · SonarQube Version: 7.2.1.14109 I am trying to run sonar-swift on my project and I am getting testing failed because some of my pods aren’t fat files and the following build commands failed: PrecompileSwiftBridgingHeader normal x86_64 CompileSwiftSources normal x86_64 com.apple.xcode.tools.swift.compiler My project does run without problems from XCode. 2018-08-03 11:50:19.292 xcodebuild[47834 ... How to set up it on xCode to work? ... 11:56+01:00 Authentication code ... symbol(s) not found for architecture x86_64 clang: error: linker command failed with exit ...

Mar 11, 2019 · I moved codes from extension to its class body block, those errors are gone! After the successful build, I changed the compilation mode back iOS recommended default Incremental mode again. References. Wikipedia: Xcode; Swift org: Swift 5 Released! SO question: Command CompileSwift failed with a nonzero exit code in Xcode 10 ; Read More... Nov 11, 2010 · ld: symbol(s) not found for architecture i386 clang: error: linker command failed with exit code 1 (use -v to see invocation) 2/27/2012 11:53 am Rick said... path errors are usually due to there being spaces in the path to your compile directory.

Command PhaseScriptExecution failed with a nonzero exit code Xcode 11.3.1. ... I am getting Command PhaseScriptExecution failed ... Library/Developer/Xcode ... Student exploration energy conversion in a system gizmo answer key

Xcode 11.2.1 - Command CodeSign failed with a nonzero exit code Xcode 11.2.1 - Command CodeSign failed with a nonzero exit code 由 ↘锁芯ラ 提交于 2020-02-05 04:04:48 American yawp chapter 6 summary

This is only necessary for node < v0.11 since node_extensions.h and node_extensions.cc drastically changed during 0.11 development until they completely disappeared around v0.11.12. Starting with v0.11.13 an addon module can be loaded dynamically even if it is not registered in the source code. Example Joann fabrics near me

Go to XCode > Preferences > Locations, and make sure that the Command Line Tools dropdown says "Xcode 9.0". Only v9 of XCode has the ARKit code, so it won't find it to compile if your command line tools are set to use an older version. Command CodeSign failed with a nonzero exit code (Something.framework) Trash DD Content; rm -rf /Users/dx/Library/Developer/Xcode/DerivedData/* Restart XCode; Build Phases => Link Binary With Libraries. Something.framework, Set embed value in General => Something.framework => EMBED. Do not embed; Press Cmd+B (Build Project) Hopefully Built Successful

I'm using Xcode Version 11.0 beta (11M336w). Finally I downloaded a fresh copy and replaced the one I had previously installed. I got the same error when linking separate storyboards. The error, "Command CompileSwiftSources failed with a nonzero exit code." is shown because I simply forgot...Tesol exam fee

Oct 02, 2018 · This is a known issue documented in Swift 4.2 Release Notes for Xcode 10. Compilation might fail without displaying the errors responsible for the failure. For example, you might see the message “Command CompileSwiftSources failed with a nonzero exit code” without an accompanying failure reason. 1) deleting Xcode.app 2) downloading and installing Xcode 10.3.xip and Command_Line_Tools_macOS_10.14_for_Xcode_10.3.dmg from Apple Developper website? In particular, is there something to do about the ports successfully upgraded with Xcode 11 before one port failed to upgrade (openblas in my case)? Thanks for your help!

DDUXJ~€I"€@ ZìMgic @ !œ$ ( -.0¬4Ž8 à 2ÿù !« « , Iöˆ( ÇL ] ‡ „ ¤$ $ È ] [email protected]( Uÿÿ ] ‡ „ ¤$ @. ] } ‡ RunNumberArrayHiers ?ÿ ... Jan 15, 2018 · id: framework not found FileProvider for architecture armv7 clang: error: linker command failed with exit code 1 (use -v to see invocation) Error: ** BUILD FAILED ** The following build commands failed: Ld Payload/Bmap4I.app/Bmap4I normal armv7 (1 failure)

[Xcode] Xcode10.2 업데이트 후 libstdc++ 에러 (0) 2019.04.18 [Xcode] Linker command failed with exit code 1 (use -v to see invocation) 에러 (0) 2018.11.13 [Xcode] Static Library 파일(.a file) 만들어서 Swift 프로젝트에 적용하기 (0) 2018.11.12 [Xcode]Embedded Binaries와 Linked Frameworks and Libraries의 차이 (0) 2018.11.06

Profinet open source code
That's a good idea. I've tried the same with Debian 8 with the same result. Building on Debian 7 fails with cmake being too old (2.8.11-1 from backports vs. 2.8.12 being required) :-(– thomas.mc.work Oct 11 '17 at 6:34

Bcm front sight
I am supposed to make a program that inputs user's name, birthdate, and grade (in percent) and display all of that with the grade (letter). It works perfectly fine, but I wanted to verify that the user's name didn't contain numbers. Now is when I get the errors. Here is my code (I am running this in XCode): Oct 25, 2017 · Welcome to LinuxQuestions.org, a friendly and active Linux Community. You are currently viewing LQ as a guest. By joining our community you will have the ability to post topics, receive our newsletter, use the advanced search, subscribe to threads and access many other special features.

Jan 15, 2018 · id: framework not found FileProvider for architecture armv7 clang: error: linker command failed with exit code 1 (use -v to see invocation) Error: ** BUILD FAILED ** The following build commands failed: Ld Payload/Bmap4I.app/Bmap4I normal armv7 (1 failure)
‎̸ҳ /̵͇̿̿/'̿̿ ̿ ̿ ̿( بحبك ) ̿ ̿̿ ̿'̿'\\̵͇̿̿\\ ҳ‎. 1,3 mil Me gusta. ‎{♥} لنْ أترُك حُبـكـ حتىَّ لو كَانْ عُمري بسَّببُـه سينتَّهـي {♥}‎
Shift + Command + K & Option + Shift + Command + K. Tagged with xcode, ios. DEV is a community of 532,251 amazing developers. We're a place where coders share, stay up-to-date and grow their careers.
collect2: error: ld returned 1 exit status 问题解决; In function `_start' undefined reference to `main' error: ld returned 1 exit status; Dev-Cpp中[Error] ld returned 1 exit status和.exe: Permission denied问题; F:\collect2.exe [Error] ld returned 1 exit status是什么地方出了问题?(C语言) 关于IDE软件(Dev cpp/VS/Code ...
Apr 25, 2019 · The Event Manager Server will return a code that indicates whether or not the CLI command should be executed. skip--A "yes" means that the CLI command should not be executed if the sync flag is not set. occurs
gnuplot 5.0 An Interactive Plotting Program Thomas Williams & Colin Kelley Version 5.0 organized by: Ethan A Merritt and many others Major contributors (alphabetic order): Christoph Bersch, Hans-Bernhard Br¨oker, John Campbell, Robert Cunningham, David Denholm, Gershon Elber, Roger Fearick, Carsten Grammes, Lucas Hart, Lars Hecking, P´eter Juh´asz, Thomas Koenig, David Kotz, Ed Kubaitis ...
c2hs-0.13.6/AUTHORS0000644000200000020000000000115310242522467013324 0ustar chakchak00000000000000Manuel M. T. Chakravarty Sven Panne wrote `general/GetOpt.hs' Thanks ...
Oct 22, 2020 · For Xcode 11, React Native development environment. I usually have this problem when a dependency is not updated. You can try following these steps, this usually works for me: 1- Delete your Podfile.lock (I like to use the command ‘-rm -rf Podfile.lock’ on the terminal for this)
2019-11-12 10:07 来自 甘林梦 Xcode错误提示:Command CompileSwiftSources failed with a nonzero exit code,网上找了好多才搞定,通过在Build Setting里面自添加一条user-defined(备注:点击Level 边上的 + 号就可以添加),属性为SWIFT_ENABLE_BATCH_MODE,值为NO。
‎̸ҳ /̵͇̿̿/'̿̿ ̿ ̿ ̿( بحبك ) ̿ ̿̿ ̿'̿'\\̵͇̿̿\\ ҳ‎. 1.394 Me gusta. ‎{♥} لنْ أترُك حُبـكـ حتىَّ لو كَانْ عُمري بسَّببُـه سينتَّهـي {♥}‎
Solution. Open Terminal, and run the following: xcode-select --install. This will download and install the Command Line Tools package and fix the problem. You do not need Xcode, you can install only the Command Line Tools here, it is about 130Mb. If the above alone doesn't do it, then also run: xcode-select --reset.
Shift + Command + K & Option + Shift + Command + K. Tagged with xcode, ios. DEV is a community of 532,251 amazing developers. We're a place where coders share, stay up-to-date and grow their careers.
2018-01-10 2018-01-11. ... linker command failed with exit code 1 (use -v to see invocation) ... handled will terminate the Node.js process with a non-zero exit code.
Linker command failed with exit code 1 現在C++をベースにした openFrameworks というライブラリを用いて開発していますが、たまにこのエラーに遭遇します。 また、このエラー自体は swift や Objective-C を使った開発でも見かけたことがありますので、Xcodeのエラーだと思わ ...
ld: symbol(s) not found for architecture x86_64 ... clang: error: linker command failed with exit code 1 (use -v to see invocation) ... xcode 3.2 xcode 4 xcode 5 ...
May 16, 2019 · libstdc++ has been deprecated for some time and Apple finally removed it with the release of Xcode 10. If you need a C++ standard library you’ll have to switch to libc++: Deprecations. Building with libstdc++ was deprecated with Xcode 8 and is not supported in Xcode 10 when targeting iOS.
But the build failed with a "Command PhaseScriptExecution failed with a nonzero exit code" error After downloading the sample projects, I tried to run them. But the build failed with a "Command I have this problem using Xcode 11.4.1. The build log indicates that it is a 'Permission denied' problem...
I'm building a game with an UnrealCV inside. I have UE 4.21 and downloaded UnrealCV from the 4.22 branch (cause it looks to be the closest version to 4.21) I'm running UE on macOS 10.14.6, Xcode 11.3.1 I placed the unrealcv folder inside the Plugins folder, then added a C++ class, then created the Xcode project and run
=== BUILD TARGET qtplugininfo OF PROJECT qtplugininfo WITH CONFIGURATION Release === Check dependencies Ld .obj ... command failed with exit code ... 11 with xcode 7 ...
DDUXJ~€I"€@ ZìMgic @ !œ$ ( -.0¬4Ž8 à 2ÿù !« « , Iöˆ( ÇL ] ‡ „ ¤$ $ È ] [email protected]( Uÿÿ ] ‡ „ ¤$ @. ] } ‡ RunNumberArrayHiers ?ÿ ...
一、问题描述 使用 Xcode 进行代码编写,在进行项目开发拉下来新项目代码的时候编译的过程中一直在报下面这个错误。Command PhaseScriptExecution failed with a nonzero exit code 通过在网上进行查找后,网上给出的大多数解决方法都是下面这样,但是我进行尝试后,问题不但没有得到解决,反而报了更多的错误 ...
Linker command failed with exit code 1 現在C++をベースにした openFrameworks というライブラリを用いて開発していますが、たまにこのエラーに遭遇します。 また、このエラー自体は swift や Objective-C を使った開発でも見かけたことがありますので、Xcodeのエラーだと思わ ...
Mkdir Foo Mkdir: Foo: Permission Denied My Thoughts Are To Use Chown/chmod But I'm Hesitant To Do So Without Asking First. /Volumes > Ll Total 8 [email protected] 4 Root Admin 136B Apr
在mac上用Xcode写程序, run的时候总是失败, 显示clang: error: linker command failed with exit code 1. 问题: 导入某个类文件出现: ...clang: error: linker command failed with exit code 1 (use -v to see invocation) 用的是Mac OSX 10.8.2 xcode 是 4.5.1 不知道怎麼回事, 肯定不是我程序的问题 而且换了其他
关于Xcode Command PhaseScriptExecution failed with a nonzero exit code 解决方案. 一、问题描述 使用 Xcode 进行代码编写,在进行项目开发拉下来新项目代码的时候编译的过程中一直在报下面这个错误。 Command PhaseScriptExecution failed with a nonzero exit code 通过在网上进行查找后,...
Добыла макбук для тестирования приложения, написанного на native-script vue. Установила все по инструкции, приложение билдится в эмуляторе Android, но никак не билдится в эмуляторе ios.
Xcode11での「Command CompileSwiftSources failed with a nonzero exit code」解消方法 2019.12.02 [jquery] jquery datepickerで特定の日付の背景色を変更する方法
Hello I need to use the quanteda package to analyse text for my studies. I am quite new to R studio and would appreciate your help. I am trying to install the package with: install.packages("quanteda") The answer code I get is the following: Warning in install.packages : dependency 'statnet.common' is not available also installing the dependencies 'sna', 'proxyC' There are binary versions ...